[buildroot 0001117]: Building toolchains fails with libstdc++-v3 enabled

bugs at busybox.net bugs at busybox.net
Thu Dec 14 17:29:48 UTC 2006


The following issue has been SUBMITTED. 
====================================================================== 
http://busybox.net/bugs/view.php?id=1117 
====================================================================== 
Reported By:                lalla521
Assigned To:                uClibc
====================================================================== 
Project:                    buildroot
Issue ID:                   1117
Category:                   Architecture Specific
Reproducibility:            always
Severity:                   block
Priority:                   normal
Status:                     assigned
====================================================================== 
Date Submitted:             12-14-2006 09:29 PST
Last Modified:              12-14-2006 09:29 PST
====================================================================== 
Summary:                    Building toolchains fails with libstdc++-v3 enabled
Description: 
hi there, i am trying to compile a toolchain for mips32, i can compile just
fine but when i enable c++ in configuration make fails with apparently no
reason.

this is what i get:

make[4]: Leaving directory
`/home/bracco/buildroot/toolchain_build_mips_nofpu/gcc-3.4.2-final/mips-linux-uclibc/libstdc++-v3/src'
make[3]: *** [install-am] Error 2
make[3]: Leaving directory
`/home/bracco/buildroot/toolchain_build_mips_nofpu/gcc-3.4.2-final/mips-linux-uclibc/libstdc++-v3/src'
make[2]: *** [install-recursive] Error 1
make[2]: Leaving directory
`/home/bracco/buildroot/toolchain_build_mips_nofpu/gcc-3.4.2-final/mips-linux-uclibc/libstdc++-v3'
make[1]: *** [install-target-libstdc++-v3] Error 2
make[1]: Leaving directory
`/home/bracco/buildroot/toolchain_build_mips_nofpu/gcc-3.4.2-final'
make: ***
[/home/bracco/buildroot/toolchain_build_mips_nofpu/gcc-3.4.2-final/.installed]
Error 2

i think it is just the compile of libstdc++ that fails because some lines
before there's this:

make[4]: Nothing to be done for `install-data-am'.
 /bin/sh ../libtool --mode=install /usr/bin/install -c  libstdc++.la
/home/bracco/buildroot/build_mips_nofpu/staging_dir/mips-linux-uclibc/lib/libstdc++.la
mips-linux-uclibc-ar: .libs/*.o: Nessun file o directory
make[4]: *** [install-exec-local] Error 1

how can i solve that? it is  veeeeeeeery annoying, i spent hours on it,
searched with google and found severeal other libstdc++ issues but none of
the solutions seems to be working for me

====================================================================== 

Issue History 
Date Modified   Username       Field                    Change               
====================================================================== 
12-14-06 09:29  lalla521       New Issue                                    
12-14-06 09:29  lalla521       Status                   new => assigned     
12-14-06 09:29  lalla521       Assigned To               => uClibc          
======================================================================




More information about the uClibc-cvs mailing list